{"text_format":"3","workbook":"xlsx","n_sheets":13,"sheets":["подбор радиатора TESI","pricelist","Ref","Расчет теплоодачи","подключения","карта цветов","вентили","дек. накладки","Термоголовка","стандартная комплектация TESI","чертеж радиатора TESI+крепеж","Приварные ноги","Радисные и угловые исполнения"],"not_rendered":{"images":20,"defined_names":19},"read":"whole","date_system":"1900"}

{"sheet":"подбор радиатора TESI","index":0,"n_rows":300,"n_cols":31,"rows_kept":300,"merged":[[1,6,1,11],[2,6,2,11]]}
[{"$nulls":6},"Валюта","Евро",null,"Курс",{"v":1,"d":"1.00"},null,"Версия:","2021/07"]
["Кому:",{"$f":"IF($G2=\"\",\"\",$G2)","v":""}]
["От:",{"$f":"IF($G3=\"\",\"\",$G3)","v":""},{"$nulls":12},"ПОДБОР РАДИАТОРОВ TESI 2-6 И КОМПЛЕКТУЮЩИХ"]
[{"$nulls":6},"Скидка, %",{"v":0,"d":"0.00"},{"$nulls":6},"ПРАЙС-ЛИСТ 2021 (повышение цен с 1/07/2021)"]
["Дата:",{"$f":"TODAY()","v":"2021-07-05"}]
[{"$nulls":6},"1) Вводить данные ТОЛЬКО в поле, выделенное желтым цветом."]
["Тема:","Предложение на трубчатые радиаторы IRSAP TESI",{"$nulls":4},"Можно также добавлять комплектующие, см. столбец справа от таблицы",{"$nulls":7},"ВНИМАНИЕ:","Некоторые модели пока не прошли "]
[{"$nulls":6},"2) Оцинкованное исполнение для влажных помещений радиаторов по запросу",{"$nulls":8},"сертификацию, при выборе будут выделены"]
[{"$nulls":6},"3) Стандартная комплектация радиаторов TESI: ",{"$nulls":8},"красным цветом.",{"$nulls":8},"`",{"$nulls":5},"`"]
[{"$nulls":6},"- универсальный крепеж в цвет радиатора в зависимости от кол-ва секций;",{"$nulls":8},"Прозрачный лак (код TR) доступен начиная с высоты 300мм."]
[{"$nulls":6},"- заглушка 1/2\" или 3/4\" в зависимости от подключения + накладка на заглушку с логотипом IRSAP;"]
["В ответ на полученный запрос предлагаем ознакомиться с предложением",{"$nulls":5},"- воздухоотводчик",{"$nulls":11},{"$f":"\"'\"&S$13&\"'!\"","v":"'pricelist'!"}]
["на изготовление радиаторов IRSAP TESI:",{"$nulls":17},"pricelist"]
[{"$nulls":18},{"$f":"VLOOKUP($S$17,Ref!$T:$U,2,0)","v":"$M:$M"}]
[null,null," ",{"$nulls":3},"Tubes","Model",{"$nulls":3},"Color",null,null,"Connection",{"$nulls":3},"delta",null,"special",{"$nulls":4},"ventil"]
["Поз.","Артикул","Описание","Кол-во",{"$f":"\"Стоимость, \"&$H$1","v":"Стоимость, Евро"},null,"Кол-во трубок (глубина)","Модель","Межось, мм","Кол-во секций","Длина рад., мм","Код цвета","Цвет","Наценка на цвет","Подключение","Наценка на подкл.","Кол-во","Вес/ рад, кг","Вт / рад","Всего секций","Спец. исполнение","Наценка на спец. испол.","Цена радиатора",null,null,"Вентили, накладки и термоголовки \n(выбирать отдельно след. позицией)"]
[null,null,"Всего:",{"$f":"SUM($D$18:$D$114)","v":0},{"$f":"SUM($E$18:$E$65533)","v":{"v":0,"d":"0.00"}},{"$nulls":11},{"$f":"SUM($Q$18:$Q$114)","v":0},null,"ΔT70 (105/70/18C)",{"$f":"SUM($T$18:$T$114)","v":0},{"$nulls":5},"Выбирайте цвет только у вентилей (кроме белый 01 и хром 50) и введите кол-во в левой колонке ","ID1","ID2"]
[{"$f":"IF($C18=\"\",\"\",A17+1)","v":""},{"$f":"IF($Z18=\"\",IF($G18=\"\",\"\",\"RR\"&LEFT($G18,1)&$H18&IF($J18<=9,\"0\"&$J18,$J18)&$L18&\"A4\"&LEFT($O18,2)&\"N\"),VLOOKUP($Z18,Ref!$AE:$AG,3,0)&$L18)","v":""},{"$f":"IF($Z18=\"\",IF($G18=\"\",\"\",\"RR\"&LEFT($G18,1)&\" \"&$H18&\", секций \"&$J18&\", цвет \"&$L18&\", подкл. \"&LEFT($O18,3)&\", \"&$U18),$Z18&\" \"&$L18)","v":""},{"$f":"IF($Z18=\"\",IF($G18=\"\",\"\",$Q18),$Q18)","v":""},{"$f":"IF($Z18=\"\",IF($G18=\"\",\"\",$D18*$W18*$K$1),VLOOKUP($Z18,Ref!$AE:$AG,2,0)*$Q18*$K$1*(1-$H$4/100))","v":""},{"$nulls":3},{"$f":"SUMIF(pricelist!$W:$W,'подбор радиатора TESI'!$AA18,pricelist!$J:$J)","v":0},null,{"$f":"$J18*45","v":0},null,{"$f":"IF($L18=\"\",\"\",VLOOKUP($L18,Ref!$D:$J,7,0))","v":""},{"$f":"SUMIF(Ref!$D:$D,'подбор радиатора TESI'!$L:$L,Ref!$E:$E)","v":{"v":0,"d":"0.00"}},null,{"$f":"SUMIF(Ref!$F:$F,'подбор радиатора TESI'!$O:$O,Ref!$G:$G)","v":{"v":0,"d":"0.00"}},null,{"$f":"SUMIF(pricelist!$W:$W,'подбор радиатора TESI'!$AA:$AA,pricelist!$K:$K)*$J18","v":{"v":0,"d":"0.00"}},{"$f":"SUMIF(pricelist!$W:$W,$AA:$AA,INDIRECT($S$12&$S$14))*$J18","v":{"v":0,"d":"0.00"}},{"$f":"$J18*$Q18","v":0},null,{"$f":"SUMIF(Ref!$H:$H,'подбор радиатора TESI'!$U:$U,Ref!$I:$I)","v":{"v":0,"d":"0.00"}},{"$f":"(($N18*SUMIF(pricelist!$W:$W,'подбор радиатора TESI'!$AA:$AA,pricelist!$S:$S)*$J18)+$P18+IF($U18=\"радиусный\",$V18*$J18,$V18)+IF($J18>$AC18,31*1.13,0))*(1-$H$4/100)","v":{"v":0,"d":"0.00"}},{"$nulls":3},{"$f":"LEFT($G18,1)&\"/\"&$H18","v":"/"},{"$f":"LEFT($G18,1)&\"/\"&$H18","v":"/"},{"$f":"SUMIF(Ref!$R:$R,'подбор радиатора TESI'!$AB:$AB,Ref!$Q:$Q)","v":0},{"$f":"IF($Z18=\"\",1,0)","v":1}]
[{"$f":"IF($C19=\"\",\"\",A18+1)","v":""},{"$f":"IF($Z19=\"\",IF($G19=\"\",\"\",\"RR\"&LEFT($G19,1)&$H19&IF($J19<=9,\"0\"&$J19,$J19)&$L19&\"A4\"&LEFT($O19,2)&\"N\"),VLOOKUP($Z19,Ref!$AE:$AG,3,0)&$L19)","v":""},{"$f":"IF($Z19=\"\",IF($G19=\"\",\"\",\"RR\"&LEFT($G19,1)&\" \"&$H19&\", секций \"&$J19&\", цвет \"&$L19&\", подкл. \"&LEFT($O19,3)&\", \"&$U19),$Z19&\" \"&$L19)","v":""},"",{"$f":"IF($Z19=\"\",IF($G19=\"\",\"\",$D19*$W19*$K$1),VLOOKUP($Z19,Ref!$AE:$AG,2,0)*$Q19*$K$1*(1-$H$4/100))","v":""},{"$nulls":3},{"$f":"SUMIF(pricelist!$W:$W,'подбор радиатора TESI'!$AA19,pricelist!$J:$J)","v":0},null,{"$f":"$J19*45","v":0},null,{"$f":"IF($L19=\"\",\"\",VLOOKUP($L19,Ref!$D:$J,7,0))","v":""},{"$f":"SUMIF(Ref!$D:$D,'подбор радиатора TESI'!$L:$L,Ref!$E:$E)","v":{"v":0,"d":"0.00"}},null,{"$f":"SUMIF(Ref!$F:$F,'подбор радиатора TESI'!$O:$O,Ref!$G:$G)","v":{"v":0,"d":"0.00"}},null,{"$f":"SUMIF(pricelist!$W:$W,'подбор радиатора TESI'!$AA:$AA,pricelist!$K:$K)*$J19","v":{"v":0,"d":"0.00"}},{"$f":"SUMIF(pricelist!$W:$W,$AA:$AA,INDIRECT($S$12&$S$14))*$J19","v":{"v":0,"d":"0.00"}},0,null,{"$f":"SUMIF(Ref!$H:$H,'подбор радиатора TESI'!$U:$U,Ref!$I:$I)","v":{"v":0,"d":"0.00"}},{"$f":"(($N19*SUMIF(pricelist!$W:$W,'подбор радиатора TESI'!$AA:$AA,pricelist!$S:$S)*$J19)+$P19+IF($U19=\"радиусный\",$V19*$J19,$V19)+IF($J19>$AC19,31*1.13,0))*(1-$H$4/100)","v":{"v":0,"d":"0.00"}},{"$nulls":3},{"$f":"LEFT($G19,1)&\"/\"&$H19","v":"/"},"/",{"$f":"SUMIF(Ref!$R:$R,'подбор радиатора TESI'!$AB:$AB,Ref!$Q:$Q)","v":0},{"$f":"IF($Z19=\"\",1,0)","v":1}]
["",{"$f":"IF($Z20=\"\",IF($G20=\"\",\"\",\"RR\"&LEFT($G20,1)&$H20&IF($J20<=9,\"0\"&$J20,$J20)&$L20&\"A4\"&LEFT($O20,2)&\"N\"),VLOOKUP($Z20,Ref!$AE:$AG,3,0)&$L20)","v":""},"","",{"$f":"IF($Z20=\"\",IF($G20=\"\",\"\",$D20*$W20*$K$1),VLOOKUP($Z20,Ref!$AE:$AG,2,0)*$Q20*$K$1*(1-$H$4/100))","v":""},{"$nulls":3},{"$f":"SUMIF(pricelist!$W:$W,'подбор радиатора TESI'!$AA20,pricelist!$J:$J)","v":0},null,0,null,{"$f":"IF($L20=\"\",\"\",VLOOKUP($L20,Ref!$D:$J,7,0))","v":""},{"$f":"SUMIF(Ref!$D:$D,'подбор радиатора TESI'!$L:$L,Ref!$E:$E)","v":{"v":0,"d":"0.00"}},null,{"$f":"SUMIF(Ref!$F:$F,'подбор радиатора TESI'!$O:$O,Ref!$G:$G)","v":{"v":0,"d":"0.00"}},null,{"$f":"SUMIF(pricelist!$W:$W,'подбор радиатора TESI'!$AA:$AA,pricelist!$K:$K)*$J20","v":{"v":0,"d":"0.00"}},{"$f":"SUMIF(pricelist!$W:$W,$AA:$AA,INDIRECT($S$12&$S$14))*$J20","v":{"v":0,"d":"0.00"}},0,null,{"$f":"SUMIF(Ref!$H:$H,'подбор радиатора TESI'!$U:$U,Ref!$I:$I)","v":{"v":0,"d":"0.00"}},{"$f":"(($N20*SUMIF(pricelist!$W:$W,'подбор радиатора TESI'!$AA:$AA,pricelist!$S:$S)*$J20)+$P20+IF($U20=\"радиусный\",$V20*$J20,$V20)+IF($J20>$AC20,31*1.13,0))*(1-$H$4/100)","v":{"v":0,"d":"0.00"}},{"$nulls":3},"/","/",{"$f":"SUMIF(Ref!$R:$R,'подбор радиатора TESI'!$AB:$AB,Ref!$Q:$Q)","v":0},1]
{"$rows_left_out":281}
{"sheet":"pricelist","index":1,"n_rows":105,"n_cols":23,"rows_kept":105,"hidden":true}
[2,"0200",null,200,null,null,2,65,197,127,{"v":0.326,"d":"0.33"},0.33,{"v":22.722736433053214,"d":"22.72"},18.73,14.91,null,null,1.252,{"v":19.549,"d":"19.55"},{"$nulls":3},{"$f":"$A1&\"/\"&$B1","v":"2/0200"}]
[2,"0260",null,260,null,null,2,65,262,195,{"v":0.425,"d":"0.43"},0.38,{"v":30.110990178479017,"d":"30.11"},24.83,19.76,null,null,1.252,{"v":20.453,"d":"20.45"},{"$nulls":3},"2/0260"]
[2,"0300",null,300,null,null,2,65,302,235,{"v":0.482,"d":"0.48"},0.41,{"v":35.55906484189587,"d":"35.56"},29.38,23.44,null,null,1.239,{"v":20.566,"d":"20.57"},{"$nulls":3},"2/0300"]
[2,"0350",null,350,null,null,2,65,352,285,{"v":0.556,"d":"0.56"},0.45,{"v":40.69555979759353,"d":"40.70"},{"v":33.6,"d":"33.60"},26.79,null,null,1.243,{"v":21.130999999999997,"d":"21.13"},{"$nulls":3},"2/0350"]
[2,"0365",null,365,null,null,2,65,367,300,{"v":0.577,"d":"0.58"},0.46,{"v":42.2164692319785,"d":"42.22"},34.85,27.78,null,null,1.244,{"v":21.244,"d":"21.24"},{"$nulls":3},"2/0365"]
[2,"0400",null,400,null,null,2,65,402,335,{"v":0.629,"d":"0.63"},0.49,{"v":45.7850676005802,"d":"45.79"},37.78,{"v":30.1,"d":"30.10"},null,null,1.247,21.47,{"$nulls":3},"2/0400"]
[2,"0450",null,450,null,null,2,65,452,385,{"v":0.702,"d":"0.70"},0.53,{"v":50.84231137604191,"d":"50.84"},41.93,33.38,null,null,1.251,{"v":22.034999999999997,"d":"22.04"},{"$nulls":3},"2/0450"]
[2,"0500",null,500,null,null,2,65,502,435,{"v":0.775,"d":"0.78"},0.57,{"v":55.8979632188701,"d":"55.90"},46.07,36.65,null,null,1.255,{"v":22.599999999999998,"d":"22.60"},{"$nulls":3},"2/0500"]
[2,"0550",null,550,null,null,2,65,552,485,{"v":0.848,"d":"0.85"},0.61,{"v":60.95162968115964,"d":"60.95"},{"v":50.2,"d":"50.20"},39.91,null,null,1.259,{"v":23.391,"d":"23.39"},{"$nulls":3},"2/0550"]
[2,"0565",null,565,null,null,2,65,567,500,0.87,0.62,{"v":62.45825334517717,"d":"62.46"},51.43,40.88,null,null,1.26,{"v":23.503999999999998,"d":"23.50"},{"$nulls":3},"2/0565"]
[2,"0600",null,600,null,null,2,65,602,535,{"v":0.921,"d":"0.92"},0.65,{"v":65.98837672327059,"d":"65.99"},54.32,43.15,null,null,1.263,{"v":23.616999999999997,"d":"23.62"},{"$nulls":3},"2/0600"]
[2,"0650",null,650,null,null,2,65,652,585,{"v":0.994,"d":"0.99"},0.69,{"v":71.05362100809855,"d":"71.05"},58.45,{"v":46.4,"d":"46.40"},null,null,1.266,{"v":24.181999999999995,"d":"24.18"},{"$nulls":3},"2/0650"]
[2,"0750",null,750,null,null,2,65,752,685,1.14,0.77,{"v":81.19407183183093,"d":"81.19"},66.71,52.88,null,null,1.274,{"v":24.973,"d":"24.97"},{"$nulls":3},"2/0750"]
[2,"0900",null,900,null,null,2,65,902,835,1.36,0.89,{"v":96.59830270413802,"d":"96.60"},79.22,62.66,null,null,1.286,{"v":26.780999999999995,"d":"26.78"},{"$nulls":3},"2/0900"]
[2,"1000",null,1000,null,null,2,65,1002,935,{"v":1.506,"d":"1.51"},0.97,{"v":106.98604135058356,"d":"106.99"},87.64,69.22,null,null,1.294,{"v":27.685,"d":"27.69"},{"$nulls":3},"2/1000"]
[2,"1200",null,1200,null,null,2,65,1202,1135,{"v":1.798,"d":"1.80"},1.13,{"v":128.18390136773027,"d":"128.18"},104.76,82.51,null,null,1.309,{"v":32.318,"d":"32.32"},{"$nulls":3},"2/1200"]
[2,"1500",null,1500,null,null,2,65,1502,1435,{"v":2.237,"d":"2.24"},1.37,{"v":161.25398468232495,"d":"161.25"},131.32,{"v":103,"d":"103.00"},null,null,1.332,{"v":38.985,"d":"38.99"},{"$nulls":3},"2/1500"]
[2,"1800",null,1800,null,null,2,65,1802,1735,{"v":2.675,"d":"2.68"},1.61,{"v":194.40048199070011,"d":"194.40"},158.38,124.29,null,null,1.329,{"v":47.573,"d":"47.57"},{"$nulls":3},"2/1800"]
[2,"2000",null,2000,null,null,2,65,2002,1935,{"v":2.968,"d":"2.97"},1.76,{"v":216.64512038503125,"d":"216.65"},176.79,{"v":139,"d":"139.00"},null,null,1.319,{"v":53.56199999999999,"d":"53.56"},{"$nulls":3},"2/2000"]
[2,"2200",null,2200,null,null,2,65,2202,2135,3.26,1.92,{"v":239.4137786762502,"d":"239.41"},195.68,154.15,null,null,1.308,{"v":58.64699999999999,"d":"58.65"},{"$nulls":3},"2/2200"]
{"$rows_left_out":86}
{"sheet":"Ref","index":2,"n_rows":112,"n_cols":35,"rows_kept":112,"hidden":true}
[]
[]
[]
[]
[]
[{"$nulls":30},"ventil"]
["Tubes",null,"Model","Color",null,"Connection",null,null,"special",null,"head",{"$nulls":8},"delta",null,"currency",null,"delta1",null,"tubes1","tubes2",{"$nulls":7},"brackets"]
["2 (65мм)",2,"0200","01",1,"02 (1/2\")",{"v":0,"d":"0.00"},null,{"v":0,"d":"0.00"},"Стандартный белый G Код. 01\n","-",{"v":0,"d":"0.00"},null,null,"0200",2,40,"2/0200",null,"ΔT70 (105/70/18C)","$M:$M","Евро",null,"ΔT60 (90/70/20°C)","$M:$M","65 (2-колонн)",2,{"$nulls":3},"Комплект вентилей угловой, цвет белый",{"v":157.522,"d":"157.52"},"VALKROSQUCU 01",null,"без креп.(no brackets)"]
["3 (101мм)",3,"0260","TR",1.25,"30 (3/4\")",{"v":0,"d":"0.00"},"радиусный",{"v":22.599999999999998,"d":"22.60"},"Прозрачный лак G Код. TR\n","термостат. головка белый",{"v":70.05999999999999,"d":"70.06"},null,null,"0260",2,40,"2/0260",null,"ΔT60 (90/70/20C)","$N:$N","руб.",null,"ΔT50 (75/65/20°C)","$N:$N","101 (3-колонн)",3,{"$nulls":3},"Комплект вентилей угловой, цвет хром",{"v":157.522,"d":"157.52"},"VALKROSQUCU 50"]
["4 (139мм)",4,"0300","RAL",1.4,"25 (ТВВ)",{"v":162.71999999999997,"d":"162.72"},"угловой",171.76,"Другие цвета RAL","термостат. головка хром",100.57,null,null,"0300",2,40,"2/0300",null,"ΔT50 (75/65/20C)","$O:$O",{"$nulls":4},"139 (4-колонн)",4,{"$nulls":3},"Комплект вентилей угловой, цвет",{"v":185.207,"d":"185.21"},"VALKROSQUCU"]
["5 (177мм)",5,"0350","02",1.15,"26 (ТВН)",{"v":162.71999999999997,"d":"162.72"},null,null,"Слоновая кость · Ral 1013 G Код. 02\n","термостат. головка мат. хром",{"v":166.10999999999999,"d":"166.11"},null,null,"0350",2,40,"2/0350",{"$nulls":7},"177 (5-колонн)",5,{"$nulls":3},"Комплект вентилей прямой проходной, цвет белый",{"v":167.91799999999998,"d":"167.92"},"VALKRODIRCU 01"]
["6 (215мм)",6,"0365","03",1.15,"50 (НЦ)",{"v":127.68999999999998,"d":"127.69"},null,null,"Серый Манхэттен G Код. 03\n",{"$nulls":4},"0365",2,40,"2/0365",{"$nulls":7},"215 (6-колонн)",6,{"$nulls":3},"Комплект вентилей прямой проходной, цвет хром",{"v":167.91799999999998,"d":"167.92"},"VALKRODIRCU 50"]
[null,null,"0400","04",1.15,"52 (ТВЦ)",267.81,null,null,"Желтый · Ral 1021 G Код. 04\n",{"$nulls":4},"0400",2,40,"2/0400",{"$nulls":12},"Комплект вентилей прямой проходной, цвет",{"v":190.40499999999997,"d":"190.41"},"VALKRODIRCU"]
[null,null,"0450","05",1.15,"TAM (по запросу)",21.47,null,null,"Красный · Ral 3000 G Код. 05\n",{"$nulls":4},"0450",2,40,"2/0450",{"$nulls":12},"Вентильный блок угловой 50мм, цвет белый",{"v":238.20399999999998,"d":"238.20"},"VALKRO50SQUCU 01"]
[null,null,"0500","06",1.15,"05",{"v":0,"d":"0.00"},null,null,"Бордовый · Ral 3003 G Код. 06\n",{"$nulls":4},"0500",2,40,"2/0500",{"$nulls":12},"Вентильный блок угловой 50мм, цвет хром",{"v":238.20399999999998,"d":"238.20"},"VALKIRO50SQUCU 50"]
[null,null,"0550","09",1.15,"06",{"v":0,"d":"0.00"},null,null,"Коричневый · Ral 8017 G Код. 09\n",{"$nulls":4},"0550",2,40,"2/0550",{"$nulls":12},"Вентильный блок угловой 50мм, цвет",{"v":260.691,"d":"260.69"},"VALKRO50SQUCU"]
[null,null,"0565","10",1.15,"07",{"v":0,"d":"0.00"},null,null,"Черный · Ral 9005 G Код. 10\n",{"$nulls":4},"0565",2,40,"2/0565",{"$nulls":12},"Вентильный блок прямой проходной 50мм, цвет белый",{"v":238.20399999999998,"d":"238.20"},"VALKRO50DIRCU 01"]
[null,null,"0600","16",1.25,"08",{"v":14.689999999999998,"d":"14.69"},null,null,"Жемчужно-белый R Код. 16\n",{"$nulls":4},"0600",2,40,"2/0600",{"$nulls":12},"Вентильный блок прямой проходной 50мм, цвет хром",{"v":238.20399999999998,"d":"238.20"},"VALKRO50DIRCU 50"]
[null,null,"0650","17",1.15,"09",{"v":14.689999999999998,"d":"14.69"},null,null,"Oранжевый · Ral 2004 G Код. 17\n",{"$nulls":4},"0650",2,40,"2/0650",{"$nulls":12},"Вентильный блок прямой проходной 50мм, цвет",{"v":260.691,"d":"260.69"},"VALKRO50DIRCU"]
[null,null,"0750","18",1.25,"10",{"v":14.689999999999998,"d":"14.69"},null,null,"Графитово-черный R Код. 18\n",{"$nulls":4},"0750",2,40,"2/0750",{"$nulls":13},{"v":0,"d":"0.00"}]
{"$rows_left_out":93}
{"sheet":"Расчет теплоодачи","index":3,"n_rows":19,"n_cols":2,"rows_kept":19}
["Кол-во трубок",4]
["Модель","0300"]
["Температура подающей линии, C",105]
["Температура обратной линии, C",70]
["Температура окружающей среды, С",18]
[]
["Номинальная тепловая мощность, Вт",{"$f":"SUMIF(pricelist!$W:$W,'Расчет теплоодачи'!$B$1&\"/\"&'Расчет теплоодачи'!$B$2,pricelist!$N:$N)","v":52.93}]
[]
["Коэффициент модификации, n",{"$f":"SUMIF(pricelist!$W:$W,'Расчет теплоодачи'!$B$1&\"/\"&'Расчет теплоодачи'!$B$2,pricelist!$R:$R)","v":1.258}]
[]
["Дельта Т, C",{"$f":"($B$3+$B$4)/2-$B$5","v":69.5}]
[]
["Расчет тепловой мощности 1 секции, Вт",{"$f":"$B$7*POWER(($B$11/60),$B$9)","v":{"v":63.68021267833296,"d":"63.68"}}]
[]
["Количество секций радиатора",10]
[]
["Длина радиатора (без переходников), мм",{"$f":"B15*45","v":450}]
[]
["Тепловая мощность радиатора, Вт",{"$f":"B13*B15","v":{"v":636.8021267833295,"d":"636.80"}}]

{"sheet":"подключения","index":4,"n_rows":0,"n_cols":0,"rows_kept":0}

{"sheet":"карта цветов","index":5,"n_rows":0,"n_cols":0,"rows_kept":0}

{"sheet":"вентили","index":6,"n_rows":0,"n_cols":0,"rows_kept":0}

{"sheet":"дек. накладки","index":7,"n_rows":0,"n_cols":0,"rows_kept":0}

{"sheet":"Термоголовка","index":8,"n_rows":0,"n_cols":0,"rows_kept":0}

{"sheet":"стандартная комплектация TESI","index":9,"n_rows":23,"n_cols":12,"rows_kept":23}
["Комплектация радиаторов TESI"]
[]
["Полная комплектация радиатора"]
["- Крепеж TESI включен в цену за секцию радиатора, его не нужно дополнительно подбирать. Поставляется в зависимости от кол-ва секций в цвет радиатора  "]
{"$rows_empty":11}
["- Кран Маевского, заглушка и декоративныя накладка с фирменным логотипом"]
[]
[]
[]
[]
[]
[]
[{"$nulls":11},"Стандартная упаковка TESI"]

{"sheet":"чертеж радиатора TESI+крепеж","index":10,"n_rows":0,"n_cols":0,"rows_kept":0}

{"sheet":"Приварные ноги","index":11,"n_rows":0,"n_cols":0,"rows_kept":0}

{"sheet":"Радисные и угловые исполнения","index":12,"n_rows":0,"n_cols":0,"rows_kept":0}